{"text_format":"1","workbook":"xlsx","n_sheets":2,"sheets":["Grundeinstellungen","EB_Rechner"],"not_rendered":{"charts":0,"images":1,"macros":1,"external_links":1,"defined_names":6,"comments":1,"pivot_tables":0},"unopened":[],"bounds":{"document_bytes":16777216,"sheet_cells":100000,"rows_first":2000,"rows_last":500,"rows_between":2000,"halvings":0,"cell_chars":16384,"cell_head_chars":4096},"cells_cut":0,"cells_raw":0,"read":"whole","date_system":"1900"}

{"sheet":"Grundeinstellungen","index":0,"n_rows":30,"n_cols":4,"rows_kept":30,"cut":false,"hidden":false,"merged":[[17,0,17,1],[21,0,21,1],[22,0,22,1],[23,0,23,1],[1,0,1,3],[28,0,28,3],[27,0,27,3],[18,0,18,1],[19,0,19,1],[20,0,20,1],[24,0,24,1],[26,0,26,3]]}
[]
["Grundeinstellungen für die Berechnung des Elternbeitrages (ausgenommen Nachmittagstarif)\nlt. Oö. Elternbeitragsverordnung 2018 -  LGBl. Nr. 1/2018"]
[]
["Arbeitsjahr 2020/2021 *)"]
["Betreuung von Kindern unter 3 Jahren","bis max. 30 Wochenstunden","ab  31 Wochenstunden","Mindestvorgaben"]
["Anteil Elternbeitrag von Berechnungsgrundlage",3.5999999999999997E-2,4.8000000000000001E-2,"3,6% bzw. mind. 4,8%"]
["Mindestbeitrag 5-Tages-Tarif ohne Abschläge",51,51,51]
["Höchstbeitrag 5-Tages-Tarif",186,247,"€ 186 bzw. € 247"]
["Betreuung von Kindern über 3 Jahren","bis max. 30 Wochenstunden","ab 31 Wochenstunden","Mindestvorgaben"]
["Anteil Elternbeitrag von Berechnungsgrundlage",0.03,0.04,"3% bzw. mind. 4%"]
["Mindestbeitrag ohne Abschläge",44,44,44]
["Höchstbeitrag 5-Tages-Tarif",115,152,"€ 115 bzw. € 152"]
["Betreuung von Schulkindern","bis max. 25 Wochenstunden","ab 26 Wochenstunden","Mindestvorgaben"]
["Anteil Elternbeitrag von Berechnungsgrundlage",0.03,0.04,"3% bzw. mind. 4%"]
["Mindestbeitrag ohne Abschläge",44,44,44]
["Höchstbeitrag 5-Tages-Tarif",115,152,"€ 115 bzw. € 152"]
[]
["Verkürzte Inanspruchnahme für Kinder unter 3 Jahren und Schulkinder",null,null,"Mindestvorgaben"]
["3-Tages-Tarif",null,0.7,0.7]
["2-Tages-Tarif",null,0.5,0.5]
["Abschläge",null,null,"Maximalvorgaben"]
["Abschlag für 2. Kind in einer beitragspflichtige**) Kinderbetreuungseinrichtung",null,0.5,0.5]
["Abschlag für ein 3. oder weiteres Kind in einer beitragspflichtige**) Kinderbetreuungseinrichtung",null,1,1]
["Abschlag vom ermittelten Familieneinkommen je weiterem nicht selbsterhaltungsfähigem Kind (§ 140 ABGB) im Haushalt",null,200,200]
["Die Werte dieser Felder können gemäß Tarifordnung geändert werden"]
["Anmerkung:"]
["*) Gemäß § 7 Oö. Elternbeitragsverordnung 2018 ändern sich der Mindest- und der Höchstbeitrag gemäß §§ 4 und 5, der Elternbeitrag gemäß § 12 sowie die Materialbeiträge (Werkbeiträge) gemäß § 13 jeweils zu Beginn des nächstfolgenden Arbeitsjahres entsprechend der Änderung des von der Statistik Austria kundgemachten Verbraucherpreisindex 2015 oder eines an seine Stelle tretenden Index gegenüber dem durchschnittlichen Index des vorangegangenen Kalenderjahres, erstmals zu Beginn des Arbeitsjahres 2019/2020. Dabei ist nach mathematischen Rundungsregeln auf ganze Eurobeträge zu runden.\n(Anpassung zum Beginn des Arbeitsjahres 2019/2020: + 2%; 2020/2021: + 1,5%)"]
["**) Beitragspflicht besteht für ein\n- Kind vor dem vollendeten 30. Lebensmonat, \n- Kind ab dem vollendeten 30. Lebensmonat für die Betreuung ab 13.00 Uhr,\n- Kind ab dem Schuleintritt,\n- Kind, das über keinen Hauptwohnsitz in OÖ verfügt."]
["Für die Berechung des Nachmittagstarifes steht ein eigener Elternbeitragsrechner zur Verfügung."]
["Version vom: 01.03.2020"]

{"sheet":"EB_Rechner","index":1,"n_rows":38,"n_cols":4,"rows_kept":38,"cut":false,"hidden":false,"merged":[[29,0,29,3]]}
[]
["Berechnung des Elternbeitrages für"]
[]
["Alter:"]
[null,"Kind ist unter 3 Jahre",null,1]
[null,"Kind ist über 3 Jahre"]
[null,"Kind ist Schulkind"]
["Betreuungsausmaß:"]
[null,"Betreuungszeit bis max. 30 Wochenstunden bzw. max. 25 Wochenstunden bei Schulkind",null,1]
[null,"Darüber hinausgehende Inanspruchnahme"]
[null,"Anteil Elternbeitrag",{"$f":"IF(AND($D$5=1,$D$9=1),Grundeinstellungen!$B$6,IF(AND($D$5=1,$D$9=2),Grundeinstellungen!$C$6,IF(AND(OR($D$5=2,$D$5=3),$D$9=1),Grundeinstellungen!$B$10,IF(AND(OR($D$5=2,$D$5=3),$D$9=2),Grundeinstellungen!$C$10))))","v":3.5999999999999997E-2}]
["ABSCHLÄGE"]
["Tage pro Woche"]
[null,"5 Tage pro Woche - kein Abschlag",null,1]
[null,"3 Tage pro Woche"]
[null,"2 Tage pro Woche"]
[null,"Abschlag für Inanspruchnahme",{"$f":"IF(D5=2,0,CHOOSE($D$14,0,1-Grundeinstellungen!C19,1-Grundeinstellungen!C20))","v":0}]
["Geschwisterabschlag:"]
[null,"Kind ist das 1. Kind der Familie in einer beitragspflichtigen*) Einrichtung - kein Abschlag",null,1]
[null,"Kind ist das 2. Kind der Familie in einer beitragspflichtigen*) Einrichtung"]
[null,"Kind ist das 3. oder weitere Kind der Familie in einer beitragspflichtigen*) Einrichtung"]
[null,"Abschlag für Geschwister in beitragspflichtigen Einrichtungen",{"$f":"CHOOSE($D$19,0,Grundeinstellungen!C22,Grundeinstellungen!C23)","v":0}]
["mtl. Brutto-Familieneinkommen ",null,0]
[null,"... weitere(s) nicht selbsterhaltungsfähige(s) Kind(er) im Haushalt                               Anzahl",0,{"$f":"C24*-Grundeinstellungen!C24","v":0}]
["Berechnungsgrundlage",null,{"$f":"IF(($C$23+$D$24)<0,0,($C$23+$D$24))","v":0}]
[]
[{"$f":"IF(D14=1,\"Errechneter monatlicher ELTERNBEITRAG für 5 Tage/Woche\",IF(D14=2,\"Errechneter monatlicher ELTERNBEITRAG für 3 Tage/Woche\",IF(D14=3,\"Errechneter monatlicher ELTERNBEITRAG für 2 Tage/Woche\")))","v":"Errechneter monatlicher ELTERNBEITRAG für 5 Tage/Woche"},null,{"$f":"IF(C22=1,0,IF(C37<C35,C35,C37))","v":51}]
[]
["Anmerkung:"]
["*) Beitragspflicht besteht für ein\n- Kind vor dem vollendeten 30. Lebensmonat, \n- Kind ab dem vollendeten 30. Lebensmonat für die Betreuung ab 13.00 Uhr,\n- Kind ab dem Schuleintritt,\n- Kind, das über keinen Hauptwohnsitz in OÖ verfügt."]
[]
["Felder in dieser Farbe bedeuten: Benötigte Angaben zur Berechnung des Elternbeitrages hier eingeben. "]
[]
["PARAMETER für die Berechung des Elternbeitrages"]
[{"$f":"Grundeinstellungen!A7","v":"Mindestbeitrag 5-Tages-Tarif ohne Abschläge"},null,{"$f":"IF(AND(D5=1,D9=1),Grundeinstellungen!B7,IF(AND(D5=1,D9=2),Grundeinstellungen!C7,IF(AND(OR(D5=2,D5=3),D9=1),Grundeinstellungen!B11,IF(AND(OR(D5=2,D5=3),D9=2),Grundeinstellungen!C11))))","v":51}]
[{"$f":"Grundeinstellungen!A8","v":"Höchstbeitrag 5-Tages-Tarif"},null,{"$f":"IF(AND(D5=1,D9=1),Grundeinstellungen!B8,IF(AND(D5=1,D9=2),Grundeinstellungen!C8,IF(AND(D5=2,D9=1),Grundeinstellungen!B12,IF(AND(D5=2,D9=2),Grundeinstellungen!C12,IF(AND(D5=3,D9=1),Grundeinstellungen!B16,IF(AND(D5=3,D9=2),Grundeinstellungen!C16,))))))","v":186}]
["Berechnung für Begrenzung auf Mindestbeitrag ",null,{"$f":"IF($C$25*$C$11<$C$35,$C$35,IF($C$25*$C$11>$C$36,$C$36,$C$25*$C$11))*(1-$C$17)*(1-$C$22)","v":51}]
["Version vom: 01.03.2020"]