{"text_format":"1","workbook":"xlsx","n_sheets":2,"sheets":["Grundeinstellungen","EB_Rechner"],"not_rendered":{"charts":0,"images":1,"macros":1,"external_links":1,"defined_names":6,"comments":1,"pivot_tables":0},"unopened":[],"bounds":{"document_bytes":16777216,"sheet_cells":100000,"rows_first":2000,"rows_last":500,"rows_between":2000,"halvings":0,"cell_chars":16384,"cell_head_chars":4096},"cells_cut":0,"cells_raw":0,"read":"whole","date_system":"1900"}

{"sheet":"Grundeinstellungen","index":0,"n_rows":20,"n_cols":4,"rows_kept":20,"cut":false,"hidden":false,"merged":[[18,0,18,3],[9,0,9,1],[13,0,13,1],[14,0,14,1],[15,0,15,1],[1,0,1,2],[10,0,10,1],[11,0,11,1],[12,0,12,1],[16,0,16,1]]}
[]
["Grundeinstellungen für die Berechnung des Elternbeitrages\nlt. Oö. Elternbeitragsverordnung 2018"]
[]
["gültig im Arbeitsjahr 2020/21*)"]
["Betreuung von Kindern vom vollendeten \n30. Lebensmonat bis zum Schuleintritt ","Nachmittagsbetreuung\nab 13:00 Uhr"]
["Anteil Elternbeitrag von Berechnungsgrundlage",0.03]
["Mindestbeitrag ohne Abschläge",44]
["Höchstbeitrag 5-Tages-Tarif",114]
[]
["Abschläge für 2- bzw. 3-Tagestarif"]
["3-Tages-Tarif",null,0.7,0.7]
["2-Tages-Tarif",null,0.5,0.5]
["Abschläge",null,null,"Maximalvorgaben"]
["Abschlag für beitragspflichtigen Besuch einer KBE eines 2. Kindes",null,0.5,0.5]
["Abschlag für beitragspflichtigen Besuch einer KBE eines 3. Kindes oder weiteres Kind",null,1,1]
["Abschlag vom ermittelten Familieneinkommen je weiterem nicht selbsterhaltungsfähigem Kind (§ 231 ABGB) im Haushalt",null,200,200]
["Die Werte dieser Felder können gemäß Tarifordnung geändert werden"]
["Anmerkung:"]
["*) Gemäß § 7 Oö. Elternbeitragsverordnung 2018 ändern sich der Mindest- und der Höchstbeitrag gemäß §§ 4 und 5, der Elternbeitrag gemäß § 12 sowie die Materialbeiträge (Werkbeiträge) gemäß § 13 jeweils zu Beginn des nächstfolgenden Arbeitsjahres entsprechend der Änderung des von der Statistik Austria kundgemachten Verbraucherpreisindex 2015 oder eines an seine Stelle tretenden Index gegenüber dem durchschnittlichen Index des vorangegangenen Kalenderjahres, erstmals zu Beginn des Arbeitsjahres 2019/2020. Dabei ist nach mathematischen Rundungsregeln auf ganze Eurobeträge zu runden.\n(Anpassung zum Beginn des Arbeitsjahres 2019/2020: + 2%; 2020/2021: + 1,5%)"]
["Version vom: 01.03.2020"]

{"sheet":"EB_Rechner","index":1,"n_rows":29,"n_cols":5,"rows_kept":29,"cut":false,"hidden":false,"merged":[]}
[]
["Berechnung des Elternbeitrages für Nachmittagsbetreuung"]
[]
["Anzahl der betreuten Nachmittage pro Woche"]
[null,"5 Tage pro Woche - kein Abschlag",null,1]
[null,"3 Tage pro Woche"]
[null,"2 Tage pro Woche"]
[null,"Abschlag für 2- bzw. 3-Tagestarif",{"$f":"CHOOSE($D$5,0,1-Grundeinstellungen!C11,1-Grundeinstellungen!C12)","v":0}]
[]
["Geschwisterabschlag:"]
[null,"Kind ist das 1. Kind der Familie in einer beitragspflichtigen Einrichtung - kein Abschlag",null,1]
[null,"Kind ist das 2. Kind der Familie in einer beitragspflichtigen Einrichtung"]
[null,"Kind ist das 3. oder weitere Kind der Familie in einer beitragspflichtigen Einrichtung"]
[null,"Abschlag für Geschwister in beitragspflichtigen Einrichtungen",{"$f":"CHOOSE($D$11,0,Grundeinstellungen!C14,Grundeinstellungen!C15)","v":0}]
["mtl. Brutto-Familieneinkommen ",null,0]
[null,"... weitere(s) nicht selbsterhaltungsfähige(s) Kind(er) im Haushalt                               Anzahl",0,{"$f":"C16*-Grundeinstellungen!C16","v":0}]
["Berechnungsgrundlage",null,{"$f":"IF(($C$15+$D$16)<0,0,($C$15+$D$16))","v":0},{"$f":"IF(($C$15+$D$16)<0,0,($C$15+$D$16))","v":0}]
[]
[{"$f":"IF(D5=1,\"Errechneter monatlicher ELTERNBEITRAG für 5 Tage/Woche\",IF(D5=2,\"Errechneter monatlicher ELTERNBEITRAG für 3 Tage/Woche\",IF(D5=3,\"Errechneter monatlicher ELTERNBEITRAG für 2 Tage/Woche\")))","v":"Errechneter monatlicher ELTERNBEITRAG für 5 Tage/Woche"},null,{"$f":"C28","v":44}]
[]
["Felder in dieser Farbe bedeuten: Benötigte Angaben zur Berechnung des Elternbeitrages hier eingeben. "]
[]
["PARAMETER für die Berechung des Elternbeitrages"]
[{"$f":"Grundeinstellungen!A6","v":"Anteil Elternbeitrag von Berechnungsgrundlage"},null,{"$f":"Grundeinstellungen!B6","v":0.03}]
[{"$f":"Grundeinstellungen!A7","v":"Mindestbeitrag ohne Abschläge"},null,{"$f":"Grundeinstellungen!B7","v":44}]
[{"$f":"Grundeinstellungen!A8","v":"Höchstbeitrag 5-Tages-Tarif"},null,{"$f":"Grundeinstellungen!B8","v":114}]
["Beitragsberechnung",null,{"$f":"IF($C$17*$C$24>$C$26,$C$26,IF($C$17*$C$24<$C$25,$C$25,($C$17*$C$24)))*(1-$C$8)*(1-$C$14)","v":44},{"$f":"IF($C$17*$C$24>$C$26,$C$26,IF($C$17*$C$24<$C$25,$C$25,($C$17*$C$24)))*(1-$C$8)*(1-$C$14)","v":44},{"$f":"IF($E$17*$C$24>$C$26,$C$26,IF($E$17*$C$24<$C$25,$C$25,($E$17*$C$24)))*(1-$C$8)*(1-$C$14)","v":44}]
["Berechnung für Begrenzung auf Mindesbeitrag",null,{"$f":"IF(C14=1,0,IF(C27<(C25/2),(C25/2),C27))","v":44},{"$f":"IF(D27<(D25/2),(D25/2),D27)","v":44},{"$f":"IF(C14=1,0,IF(C27<(C25/2),(C25/2),C27))","v":44}]
["Version vom: 01.03.2020"]